Centos 6 Ruby 2.5.0 Yüklenme sorunu

Arkadaşlar yaklaşık 15 gün önce ruby 2.5.0 sürümünü çıkardı ancak centos platformunda yüklemeye çalışırken hata veriyor. Gcc'nin sürümünden kaynaklı olduğu açıklanmış. Yakın zamanda sorun çözülür ancak 2.4.3'ü yüklemekte fayda var, eğer hata alıyorsanız boşuna uğraşmayın derim. 2.4.3 kurulumu yapılabilmektedir. Bu sorun ubuntuda yaşanmamaktadır ve sorunsuz kurulum yapılabiliniyor. Bilginize olsun...

[root@babir ~]# rbenv install 2.5.0

Downloading ruby-2.5.0.tar.bz2...

-> https://cache.ruby-lang.org/pub/ruby/2.5/ruby-2.5.0.tar.bz2

Installing ruby-2.5.0...

BUILD FAILED (CentOS release 6.9 (Final) using ruby-build 20171226)

Inspect or clean up the working tree at /tmp/ruby-build.20180107214033.9561

Results logged to /tmp/ruby-build.20180107214033.9561.log

Last 10 log lines:

prelude.c: In function 'prelude_eval':

prelude.c:204: error: #pragma GCC diagnostic not allowed inside functions

prelude.c:205: error: #pragma GCC diagnostic not allowed inside functions

prelude.c:221: error: #pragma GCC diagnostic not allowed inside functions

At top level:

cc1: warning: unrecognized command line option "-Wno-self-assign"

cc1: warning: unrecognized command line option "-Wno-constant-logical-operand"

cc1: warning: unrecognized command line option "-Wno-parentheses-equality"

cc1: warning: unrecognized command line option "-Wno-tautological-compare"

make: *** [prelude.o] Error 1